{"text_format":"1","workbook":"xlsx","n_sheets":25,"sheets":["Events","Setup","Calendar","Targets","Weight","Load","Dashboard","Analytics","PivotAnalytics4","Log","Gauges","Tables","PivotAnalytics","PivotAnalytics1","PivotAnalytics2","PivotAnalytics3","PivotPlan","PivotCal","PivotSpeed","PivotWeight","PivotAddWeight","PivotWeightTarget","PivotCalTarget","PivotHRTarget","PivotPowerTarget"],"not_rendered":{"charts":19,"images":14,"macros":1,"external_links":0,"defined_names":236,"comments":0,"pivot_tables":14},"unopened":[],"bounds":{"document_bytes":16777216,"sheet_cells":100000,"rows_first":2000,"rows_last":500,"rows_between":2000,"halvings":0,"cell_chars":16384,"cell_head_chars":4096},"cells_cut":0,"cells_raw":0,"read":"whole","date_system":"1900"}

{"sheet":"Events","index":0,"n_rows":1019,"n_cols":10,"rows_kept":1019,"cut":false,"hidden":false,"merged":[]}
[null,"STATrider / Events"]
[]
[]
[null,"Date","Event","City / Venue","State","Country","Category","Class","Website"]
[null,null,null,null,null,null,null,null,null," "]
[null,null,null,null,null,null,null,null,null," "]
[null,null,null,null,null,null,null,null,null," "]
[null,null,null,null,null,null,null,null,null," "]
[null,null,null,null,null,null,null,null,null," "]
[null,null,null,null,null,null,null,null,null," "]
{"$rows_left_out":1010}
{"sheet":"Setup","index":1,"n_rows":28,"n_cols":14,"rows_kept":28,"cut":false,"hidden":false,"merged":[[28,1,28,7],[29,1,29,7],[30,1,30,7],[31,1,31,7],[2,1,2,7],[25,2,25,7],[10,2,10,7],[8,2,8,6],[9,2,9,6]]}
[null,"STATrider / Setup"]
[]
[null,"Available Time For Training",null,null,null,null,null,null,null,"Favorite Events"]
[null,"Avg. time per day:",1,"h",30,"min",null,{"$f":"Available_Annual_Hours","v":360},null,"Date","Event","City / Venue","State"]
[null,"Days per week:",5,null,null,null,null,{"$f":"Available_Annual_Hours","v":360},null,null,null,null,null,"."]
[null,"Training start date:",2,"/",28,"/",2022,{"$f":"Weeks_Available","v":25},null,null,null,null,null,"."]
[null,"Race goal date:",8,"/",20,"/",2022,{"$f":"Weeks_Available","v":25},null,null,null,null,null,"."]
[null,"Rider height:",6,"ft",0,{"$f":"IF(ISBLANK(HeightUnit)=TRUE,\"\",IF(HeightUnit=\"ft\",\"in\",\"cm\"))","v":"in"},null,null,null,null,null,null,null,"."]
[null,"First week:",{"$f":"IF(AND(StartYear<>\"\",StartMonth<>\"\",StartDay<>\"\")=TRUE,IFERROR(MONDAYDATE(DATE(StartYear,StartMonth,StartDay)),\"\"),\"\")","v":"2022-02-28"},null,null,null,null,null,null,null,null,null,null,"."]
[null,"Last week:",{"$f":"IF(AND(RaceYear<>\"\",RaceMonth<>\"\",RaceDay<>\"\")=TRUE,IFERROR(MONDAYDATE(DATE(RaceYear,RaceMonth,RaceDay)),\"\"),\"\")","v":"2022-08-15"},null,null,null,null,null,null,null,null,null,null,"."]
{"$rows_left_out":19}
{"sheet":"Calendar","index":2,"n_rows":36,"n_cols":38,"rows_kept":36,"cut":false,"hidden":false,"merged":[]}
[null,"STATrider / Calendar"]
[null,"Season 2022 / 2022"]
[]
[]
[]
[]
[]
[]
[]
[]
{"$rows_left_out":27}
{"sheet":"Targets","index":3,"n_rows":24,"n_cols":8,"rows_kept":24,"cut":false,"hidden":false,"merged":[]}
[null,"STATrider / Targets"]
[]
[null,"Wk","Date","Period","Cal. Goal","Weight Goal","HR Goal","Power Goal"]
[null,1]
[null,2]
[null,3]
[null,4]
[null,5]
[null,6]
[null,7]
{"$rows_left_out":15}
{"sheet":"Weight","index":4,"n_rows":11,"n_cols":5,"rows_kept":11,"cut":false,"hidden":false,"merged":[]}
[null,"STATrider / Weight"]
[]
[null,"Weight"]
[]
[null,189,"lb"]
[]
[null,"Date"]
[]
[null,"2022-03-21"]
[]
{"$rows_left_out":2}
{"sheet":"Load","index":5,"n_rows":5,"n_cols":25,"rows_kept":5,"cut":false,"hidden":false,"merged":[]}
[null,"STATrider / Load Data"]
[]
[]
[]
[null,"Time Period","Activities","Distance","Activity Time","Activity Calories","Elev Gain","Speed","Heart Rate","Bike Cadence","Power","Climber Index","Cal/hour","Hrs/Activity","Speed/HR","Distance Unit","Time Unit","Calories Unit","Elevation Unit","Speed Unit","Heart Rate Unit","Cadence Unit","Power Unit","WeightTable.lb","WeightTable.kg"]

{"sheet":"Dashboard","index":6,"n_rows":28,"n_cols":22,"rows_kept":28,"cut":false,"hidden":false,"merged":[[2,1,2,2]]}
[null,"STATrider / Dashboard"]
[null,null,null,null,null,null,null,null,null,null,null,null,null,null,null,null,null,null,null,null,null,"\\"]
[null,{"$f":"Season","v":"Season 2022 / 2022"}]
[]
[]
[]
[]
[]
[]
[]
{"$rows_left_out":19}
{"sheet":"Analytics","index":7,"n_rows":1,"n_cols":2,"rows_kept":1,"cut":false,"hidden":false,"merged":[]}
[null,"STATrider / Analytics"]

{"sheet":"PivotAnalytics4","index":8,"n_rows":3,"n_cols":2,"rows_kept":3,"cut":false,"hidden":true,"merged":[]}
["Row Labels","Sum of Elev Gain"]
["(blank)"]
["Grand Total"]

{"sheet":"Log","index":9,"n_rows":28,"n_cols":21,"rows_kept":28,"cut":false,"hidden":true,"merged":[]}
["Step","hh:mm:ss","Description","% of Overal Time"]
["Overall Time",1.1574076779652387E-5,null,{"$f":"SUM(D3:D14)","v":1}]
["TableCheck",0,"Check if  Target and Calendar table are correct",{"$f":"B3/TotalTime","v":0}]
["Solver",0,"Solver",0]
["Calendar",1.1574076779652387E-5,"Create Calendar",1]
["PivotPlan",0,"PivotPlan",0]
["Conditional rules",0,"ConditionalRulesTime - Period Colors",{"$f":"B7/TotalTime","v":0}]
["ChartPlan",0,"ChartPlan",{"$f":"B8/TotalTime","v":0}]
[]
[]
{"$rows_left_out":19}
{"sheet":"Gauges","index":10,"n_rows":32,"n_cols":13,"rows_kept":32,"cut":false,"hidden":true,"merged":[[0,0,0,3],[6,0,6,3]]}
["Weeks To Race Chart",null,null,null,null,null,null,null,null,null,null,null,"Charts Legends"]
[]
["Weeks to Race Gap",{"$f":"Total_Weeks_Planned*0.45","v":9.4500000000000011},{"$f":"Total_Weeks_Planned","v":21},null,null,"Today Date","2022-05-23T23:26:59"]
["Actual Week",{"$f":"C4","v":{"$error":"#N/A"}},{"$f":"IF(TodayDate<VLOOKUP(1,INDIRECT(\"Calendar\"),2,FALSE),0,IF(TodayDate>LastWeek,Total_Weeks_Planned,D4))","v":{"$error":"#N/A"}},{"$f":"MATCH(MAX(INDIRECT(\"Calendar[Today Week]\")),INDIRECT(\"Calendar[Today Week]\"),0)","v":1},null,"Actual Height",{"$f":"RIDERHEIGHT(HeightPrimary,HeightSecondary,HeightUnit)","v":72}]
[{"$f":"IF(B5>1,\"Weeks to Race\",IF(B5=1,\"Week to Race\",\"Race Week\"))","v":{"$error":"#N/A"}},{"$f":"Total_Weeks_Planned-Actual_Week","v":{"$error":"#N/A"}},{"$f":"IF(Weeks_To_Race>0,Weeks_To_Race,_xlfn.UNICHAR(127937))","v":{"$error":"#N/A"}}]
[]
["BMI Chart"]
["Actual Weight",{"$f":"D8","v":{"$error":"#N/A"}},{"$f":"WeightUnit","v":"lb"},{"$f":"IFERROR(INDEX(INDIRECT(\"Calendar\"),Actual_Week,MATCH(\"Weight\",INDIRECT(\"Calendar[#Headers]\"),0)),Last_Weight_Update)","v":{"$error":"#N/A"}}]
["Actual BMI",{"$f":"BMIf(Actual_Weight,ActualHeight)","v":{"$error":"#N/A"}},null,{"$f":"IF(C8=\"Kg\",Actual_Weight/(ActualHeight^2),Actual_Weight/(ActualHeight^2)*703)","v":{"$error":"#N/A"}}]
["BMI Min",{"$f":"BMI_min","v":21},null,null,null,"BMIGaugeGroup"]
{"$rows_left_out":23}
{"sheet":"Tables","index":11,"n_rows":76,"n_cols":113,"rows_kept":76,"cut":false,"hidden":true,"merged":[]}
[null,null,null,null,null,null,null,null,null,null,null,null,null,null,null,null,null,null,null,null,null,null,null,null,null,null,null,null,null,null,null,null,null,null,null,null,null,null,null,null,null,null,"Colors for chart series",null,null,null,null,"Chart types",null,null,null,"State Table",null,null,null,"API Table",null,null,null,null,null,null,null,null,null,null,null,null,null,null,null,null,"Event Type Table",null,null,null,null,null,"List",null,"Units Table","Field units",null,null,null,"Events Combobox Values",null,null,"UCI calendar temp path file",null,"lb",null,"For Text Box use",null,null,null,"List for Analytics ComboBoxes",null,"Analytics Fields ComboBoxes Values",null,null,"Analytics Chart and Calculation per field",null,null,null,"For Text Box use",null,"For Text Box use",null,"For Queries - M code use",null,"App status Saved Before Close"]
[]
[null,null,null,null,null,null,null,null,null,null,null,null,null,null,null,null,null,null,null,null,null,null,null,null,null,null,null,null,null,null,null,null,null,null,null,null,null,null,null,null,null,null,"Period","Rcode","Gcode","Bcode",null,"Value","Name","Description",null,"State","Abbreviation","Country",null,"Database","URL","Method","Header Type","Header Value","Event Type","Parameter1","Parameter2","Parameter3","Parameter4","Parameter5","Date","EndDate","Query","Source","QueryName",null,"Type","BikeReg","UCI","OLD-UCI","USA Cycling",null,"Season",null,"Field","Unit","Legend","Format",null,"Box Name","Value",null,"Path",null,"Weight Units",null,{"$f":"_xlfn.UNICHAR(9654)","v":"▶"},null,null,null,"UploadQueryFields",null,"Box Name","Value",null,"Field","Calculation","ChartType",null,{"$f":"_xlfn.UNICHAR(HEX2DEC(\"1F4C2\"))","v":"📂"},null,null,null,"Value"]
[null,null,null,null,null,null,null,null,null,null,null,null,null,null,null,null,null,null,null,null,null,null,null,null,null,null,null,null,null,null,null,null,null,null,null,null,null,null,null,null,null,null,{"$f":"INDEX(Setup!$B$16:$B$23,ROW()-3)","v":"Race"},0,255,0,null,-4098,"xl3DArea","3D Area",null,"ALABAMA","AL","UNITED STATES OF AMERICA",null,"BikeReg",{"$f":"\"https://www.bikereg.com/api/\"","v":"https://www.bikereg.com/api/"},"Get",null,null,{"$f":"VLOOKUP(EventType,EventTypeTable[],MATCH(APITable[[#This Row],[Database]],EventTypeTable[#Headers],0),FALSE)","v":"Road Race"},"search?","states","eventtype","year",null,{"$f":"IF(APITable[[#This Row],[Parameter4]]=\"year\",SeasonSearch,\"11%2F1%2F\"&SeasonSearch-1)","v":"2022"},{"$f":"\"10%2F31%2F\"&SeasonSearch","v":"10%2F31%2F2022"},{"$f":"IF(APITable[[#This Row],[Database]]=\"UCI\",APITable[[#This Row],[Parameter1]]&\"?\"&APITable[[#This Row],[Parameter2]]&\"=\"&APITable[[#This Row],[Event Type]]&\"&\"&APITable[[#This Row],[Parameter4]]&\"=\"&APITable[[#This Row],[Date]],IF(APITable[[#This Row],[Database]]=\"BikeReg\",APITable[[#This Row],[Parameter1]]&APITable[[#This Row],[Parameter2]]&\"=\"&StateAbbreviation&\"&\"&APITable[[#This Row],[Parameter3]]&\"=\"&APITable[[#This Row],[Event Type]]&\"&\"&APITable[[#This Row],[Parameter4]]&\"=\"&APITable[[#This Row],[Date]],APITable[[#This Row],[Parameter1]]&APITable[[#This Row],[Event Type]]&\"&\"&APITable[[#This Row],[Parameter2]]&APITable[[#This Row],[Date]]&\"&\"&APITable[[#This Row],[Parameter3]]&APITable[[#This Row],[EndDate]]&\"&\"&APITable[[#This Row],[Parameter4]]&StateAbbreviation))","v":"search?states=NY&eventtype=Road Race&year=2022"},{"$f":"APITable[[#This Row],[URL]]&APITable[[#This Row],[Query]]","v":"https://www.bikereg.com/api/search?states=NY&eventtype=Road Race&year=2022"},"BikeRegQuery",null,"Road","Road Race","ROA","ROA",19,null,{"$f":"YEAR(TodayDate)-2","v":2020},null,"Activities","Activities","Activities / Week","#,###",null,"APIBox","USA Cycling",null,"C:\\Users\\jorge\\AppData\\Local\\Temp\\UCIMTB.xlsx",null,"lb",null,null,null,"lb",null,"Activities",null,"Pivot1ComboBox1","Activity Calories",null,"Activities",-4157,51,null,{"$f":"_xlfn.UNICHAR(HEX2DEC(\"2b61\"))","v":"⭡"},null,{"$f":"UploadURL[Value]","v":" "},null," ",null,"AppVariable","Status"]
[null,null,null,null,null,null,null,null,null,null,null,null,null,null,null,null,null,null,null,null,null,null,null,null,null,null,null,null,null,null,null,null,null,null,null,null,null,null,null,null,null,null,{"$f":"INDEX(Setup!$B$16:$B$23,ROW()-3)","v":"Peak"},59,89,152,null,78,"xl3DAreaStacked","3D Stacked Area",null,"ALASKA","AK","UNITED STATES OF AMERICA",null,"USA Cycling",{"$f":"\"https://www.usacycling.org/API/events-search/\"","v":"https://www.usacycling.org/API/events-search/"},"Get",null,null,{"$f":"VLOOKUP(EventType,EventTypeTable[],MATCH(APITable[[#This Row],[Database]],EventTypeTable[#Headers],0),FALSE)","v":19},"?name=&discipline=","sub_disciplines=&event_types=&special_calendars=&date_start=","date_end=","location=&state=","&city=&zip=",{"$f":"IF(APITable[[#This Row],[Parameter4]]=\"year\",SeasonSearch,\"11%2F1%2F\"&SeasonSearch-1)","v":"11%2F1%2F2021"},{"$f":"\"10%2F31%2F\"&SeasonSearch","v":"10%2F31%2F2022"},{"$f":"IF(APITable[[#This Row],[Database]]=\"UCI\",APITable[[#This Row],[Parameter1]]&\"?\"&APITable[[#This Row],[Parameter2]]&\"=\"&APITable[[#This Row],[Event Type]]&\"&\"&APITable[[#This Row],[Parameter4]]&\"=\"&APITable[[#This Row],[Date]],IF(APITable[[#This Row],[Database]]=\"BikeReg\",APITable[[#This Row],[Parameter1]]&APITable[[#This Row],[Parameter2]]&\"=\"&StateAbbreviation&\"&\"&APITable[[#This Row],[Parameter3]]&\"=\"&APITable[[#This Row],[Event Type]]&\"&\"&APITable[[#This Row],[Parameter4]]&\"=\"&APITable[[#This Row],[Date]],APITable[[#This Row],[Parameter1]]&APITable[[#This Row],[Event Type]]&\"&\"&APITable[[#This Row],[Parameter2]]&APITable[[#This Row],[Date]]&\"&\"&APITable[[#This Row],[Parameter3]]&APITable[[#This Row],[EndDate]]&\"&\"&APITable[[#This Row],[Parameter4]]&StateAbbreviation))","v":"?name=&discipline=19&sub_disciplines=&event_types=&special_calendars=&date_start=11%2F1%2F2021&date_end=10%2F31%2F2022&location=&state=NY"},{"$f":"APITable[[#This Row],[URL]]&APITable[[#This Row],[Query]]","v":"https://www.usacycling.org/API/events-search/?name=&discipline=19&sub_disciplines=&event_types=&special_calendars=&date_start=11%2F1%2F2021&date_end=10%2F31%2F2022&location=&state=NY"},"USACyclingQuery",null,"Mountain bike","Off Road","MTB","MTB",21,null,{"$f":"YEAR(TodayDate)-1","v":2021},null,"Activity Calories",{"$f":"IFERROR(INDEX(INDIRECT(\"UploadQuery[Calories Unit]\"),MATCH(TRUE,INDEX((INDIRECT(\"UploadQuery[Calories Unit]\")<>\"\"),),0)),\"C\")","v":"C"},"Calories","#,###",null,"EventTypeBox","Road",null,null,null,"kg",null,null,null,"kg",null,"Activity Calories",null,"Pivot1ComboBox2","Cal/hour",null,"Activity Calories",-4157,51,null,{"$f":"_xlfn.UNICHAR(HEX2DEC(\"2b63\"))","v":"⭣"},null,null,null,null,null,"TargetsNeedRefresh",false]
[null,null,null,null,null,null,null,null,null,null,null,null,null,null,null,null,null,null,null,null,null,null,null,null,null,null,null,null,null,null,null,null,null,null,null,null,null,null,null,null,null,null,{"$f":"INDEX(Setup!$B$16:$B$23,ROW()-3)","v":"Build II"},210,31,52,null,79,"xl3DAreaStacked100","100% Stacked Area",null,"ARIZONA","AZ","UNITED STATES OF AMERICA",null,"UCI",{"$f":"\"https://www.uci.org/api/calendar/\"","v":"https://www.uci.org/api/calendar/"},"Get",null,null,{"$f":"VLOOKUP(EventType,EventTypeTable[],MATCH(APITable[[#This Row],[Database]],EventTypeTable[#Headers],0),FALSE)","v":"ROA"},"past","discipline",null,"year",null,{"$f":"IF(APITable[[#This Row],[Parameter4]]=\"year\",SeasonSearch,\"11%2F1%2F\"&SeasonSearch-1)","v":"2022"},null,{"$f":"IF(APITable[[#This Row],[Database]]=\"UCI\",APITable[[#This Row],[Parameter1]]&\"?\"&APITable[[#This Row],[Parameter2]]&\"=\"&APITable[[#This Row],[Event Type]]&\"&\"&APITable[[#This Row],[Parameter4]]&\"=\"&APITable[[#This Row],[Date]],IF(APITable[[#This Row],[Database]]=\"BikeReg\",APITable[[#This Row],[Parameter1]]&APITable[[#This Row],[Parameter2]]&\"=\"&StateAbbreviation&\"&\"&APITable[[#This Row],[Parameter3]]&\"=\"&APITable[[#This Row],[Event Type]]&\"&\"&APITable[[#This Row],[Parameter4]]&\"=\"&APITable[[#This Row],[Date]],APITable[[#This Row],[Parameter1]]&APITable[[#This Row],[Event Type]]&\"&\"&APITable[[#This Row],[Parameter2]]&APITable[[#This Row],[Date]]&\"&\"&APITable[[#This Row],[Parameter3]]&APITable[[#This Row],[EndDate]]&\"&\"&APITable[[#This Row],[Parameter4]]&StateAbbreviation))","v":"past?discipline=ROA&year=2022"},{"$f":"APITable[[#This Row],[URL]]&APITable[[#This Row],[Query]]","v":"https://www.uci.org/api/calendar/past?discipline=ROA&year=2022"},"UCIQuery",null,"Cyclo-cross","Cyclocross","CRO","CRO",23,null,{"$f":"YEAR(TodayDate)","v":2022},null,"Activity Time","Hrs","Hours / Week","[hh]:mm",null,"StateBox","NEW YORK",null,null,null,null,null,null,null,null,null,"Activity Time",null,"Pivot2ComboBox1","Speed",null,"Activity Time",-4157,51,null,null,null,null,null,null,null,"DashboardNeedRefresh",false]
[null,null,null,null,null,null,null,null,null,null,null,null,null,null,null,null,null,null,null,null,null,null,null,null,null,null,null,null,null,null,null,null,null,null,null,null,null,null,null,null,null,null,{"$f":"INDEX(Setup!$B$16:$B$23,ROW()-3)","v":"Build I"},166,31,52,null,60,"xl3DBarClustered","3D Clustered Bar",null,"ARKANSAS","AR","UNITED STATES OF AMERICA",null,null,null,null,null,null,null,null,null,null,null,null,null,null,null,null,null,null,"Track","Track","PIS","PIS",20,null,{"$f":"YEAR(TodayDate)+1","v":2023},null,"Actual Hrs2","Hrs","Hours / Week","[hh]:mm",null,"StateAbbreviation",{"$f":"VLOOKUP(StateSearch,StateTable[],2,FALSE)","v":"NY"},null,null,null,null,null,null,null,null,null,"Bike Cadence",null,"Pivot2ComboBox2","Cal/hour",null,"Bike Cadence",-4106,4,null,null,null,null,null,null,null,"CalendarChartNeedReset",true]
[null,null,null,null,null,null,null,null,null,null,null,null,null,null,null,null,null,null,null,null,null,null,null,null,null,null,null,null,null,null,null,null,null,null,null,null,null,null,null,null,null,null,{"$f":"INDEX(Setup!$B$16:$B$23,ROW()-3)","v":"Base III"},255,170,100,null,61,"xl3DBarStacked","3D Stacked Bar",null,"CALIFORNIA","CA","UNITED STATES OF AMERICA",null,null,null,null,null,null,null,null,null,null,null,null,null,null,null,null,null,null,null,null,null,null,null,null,null,null,"Bike Cadence",{"$f":"IFERROR(INDEX(INDIRECT(\"UploadQuery[Cadence Unit]\"),MATCH(TRUE,INDEX((INDIRECT(\"UploadQuery[Cadence Unit]\")<>\"\"),),0)),\"rpm\")","v":"rpm"},{"$f":"IFERROR(INDEX(INDIRECT(\"UploadQuery[Cadence Unit]\"),MATCH(TRUE,INDEX((INDIRECT(\"UploadQuery[Cadence Unit]\")<>\"\"),),0)),\"rpm\")","v":"rpm"},0,null,"SeasonBox","2022",null,null,null,null,null,null,null,null,null,"Cal/hour",null,"Pivot3ComboBox1","Hrs/Activity",null,"Cal/hour",-4106,4,null,null,null,null,null,null,null,"TargetsChartNeedReset",true]
[null,null,null,null,null,null,null,null,null,null,null,null,null,null,null,null,null,null,null,null,null,null,null,null,null,null,null,null,null,null,null,null,null,null,null,null,null,null,null,null,null,null,{"$f":"INDEX(Setup!$B$16:$B$23,ROW()-3)","v":"Base II"},255,128,80,null,62,"xl3DBarStacked100","3D 100% Stacked Bar",null,"COLORADO","CO","UNITED STATES OF AMERICA",null,null,null,null,null,null,null,null,null,null,null,null,null,null,null,null,null,null,null,null,null,null,null,null,null,null,"Cadence",{"$f":"IFERROR(INDEX(INDIRECT(\"UploadQuery[Cadence Unit]\"),MATCH(TRUE,INDEX((INDIRECT(\"UploadQuery[Cadence Unit]\")<>\"\"),),0)),\"rpm\")","v":"rpm"},{"$f":"IFERROR(INDEX(INDIRECT(\"UploadQuery[Cadence Unit]\"),MATCH(TRUE,INDEX((INDIRECT(\"UploadQuery[Cadence Unit]\")<>\"\"),),0)),\"rpm\")","v":"rpm"},0,null,null,null,null,null,null,null,null,null,null,null,null,"Climber Index",null,"Pivot3ComboBox2","Cal/hour",null,"Climber Index",-4106,4,null,null,null,null,null,null,null,"DashboardChartNeedReset",true]
[null,null,null,null,null,null,null,null,null,null,null,null,null,null,null,null,null,null,null,null,null,null,null,null,null,null,null,null,null,null,null,null,null,null,null,null,null,null,null,null,null,null,{"$f":"INDEX(Setup!$B$16:$B$23,ROW()-3)","v":"Base I"},255,128,0,null,-4100,"xl3DColumn","3D Column",null,"CONNECTICUT","CT","UNITED STATES OF AMERICA",null,"OLD-UCI",{"$f":"\"https://www.uci.org/web-interface/Base/ExportExcelCalendar\"","v":"https://www.uci.org/web-interface/Base/ExportExcelCalendar"},"Post","Content-Type","application/x-www-form-urlencoded",{"$f":"VLOOKUP(EventType,EventTypeTable[],MATCH(APITable[[#This Row],[Database]],EventTypeTable[#Headers],0),FALSE)","v":{"$error":"#VALUE!"}},null,null,null,null,null,{"$f":"IF(APITable[[#This Row],[Parameter4]]=\"year\",SeasonSearch,\"11%2F1%2F\"&SeasonSearch-1)","v":{"$error":"#VALUE!"}},{"$f":"\"10%2F31%2F\"&SeasonSearch","v":"10%2F31%2F2022"},{"$f":"IF(APITable[[#This Row],[Database]]=\"UCI\",APITable[[#This Row],[Parameter1]]&\"?\"&APITable[[#This Row],[Parameter2]]&\"=\"&APITable[[#This Row],[Event Type]]&\"&\"&APITable[[#This Row],[Parameter4]]&\"=\"&APITable[[#This Row],[Date]],IF(APITable[[#This Row],[Database]]=\"BikeReg\",APITable[[#This Row],[Parameter1]]&APITable[[#This Row],[Parameter2]]&\"=\"&StateAbbreviation&\"&\"&APITable[[#This Row],[Parameter3]]&\"=\"&APITable[[#This Row],[Event Type]]&\"&\"&APITable[[#This Row],[Parameter4]]&\"=\"&APITable[[#This Row],[Date]],APITable[[#This Row],[Parameter1]]&APITable[[#This Row],[Event Type]]&\"&\"&APITable[[#This Row],[Parameter2]]&APITable[[#This Row],[Date]]&\"&\"&APITable[[#This Row],[Parameter3]]&APITable[[#This Row],[EndDate]]&\"&\"&APITable[[#This Row],[Parameter4]]&StateAbbreviation&APITable[[#This Row],[Parameter5]]))","v":{"$error":"#VALUE!"}},{"$f":"APITable[[#This Row],[URL]]&APITable[[#This Row],[Query]]","v":{"$error":"#VALUE!"}},"UCIQuery",null,null,null,null,null,null,null,null,null,"Cal.",{"$f":"IFERROR(INDEX(INDIRECT(\"UploadQuery[Calories Unit]\"),MATCH(TRUE,INDEX((INDIRECT(\"UploadQuery[Calories Unit]\")<>\"\"),),0)),\"C\")","v":"C"},"Calories","#,###",null,null,null,null,null,null,null,null,null,null,null,null,"Distance",null,"Pivot4ComboBox1","Elev Gain",null,"Distance",-4157,51,null,null,null,null,null,null,null,"PivotAnalyticsNeedRefresh",true]
{"$rows_left_out":67}
{"sheet":"PivotAnalytics","index":12,"n_rows":4,"n_cols":8,"rows_kept":4,"cut":false,"hidden":true,"merged":[]}
[null,"Values"]
["Row Labels","Count of Activities","Sum of Activity Time","Sum of Activities","Sum of Distance","Average of Hrs/Activity","Sum of Activity Calories","Sum of Elev Gain"]
["(blank)"]
["Grand Total"]

{"sheet":"PivotAnalytics1","index":13,"n_rows":4,"n_cols":3,"rows_kept":4,"cut":false,"hidden":true,"merged":[]}
[null,"Values"]
["Row Labels","Sum of Activity Calories","Average of Cal/hour"]
["(blank)"]
["Grand Total"]

{"sheet":"PivotAnalytics2","index":14,"n_rows":4,"n_cols":3,"rows_kept":4,"cut":false,"hidden":true,"merged":[]}
[null,"Values"]
["Row Labels","Average of Speed","Average of Cal/hour"]
["(blank)"]
["Grand Total"]

{"sheet":"PivotAnalytics3","index":15,"n_rows":4,"n_cols":3,"rows_kept":4,"cut":false,"hidden":true,"merged":[]}
[null,"Values"]
["Row Labels","Average of Hrs/Activity","Average of Cal/hour"]
["(blank)"]
["Grand Total"]

{"sheet":"PivotPlan","index":16,"n_rows":6,"n_cols":4,"rows_kept":6,"cut":false,"hidden":true,"merged":[]}
[null,"Column Labels"]
[null,"Sum of Today Week","Sum of Actual Hrs2","Sum of Plan. Hrs Chart"]
["Row Labels",0,0,0]
["(blank)"]
["(blank)",-21,{"$error":"#N/A"},0]
["Grand Total",-21,{"$error":"#N/A"},0]

{"sheet":"PivotCal","index":17,"n_rows":5,"n_cols":4,"rows_kept":5,"cut":false,"hidden":true,"merged":[]}
[null,"Values"]
["Row Labels","Sum of Cal.","Sum of Cal. Goal Chart","Sum of Cal/hour"]
["(blank)"]
["(blank)",null,0,{"$error":"#N/A"}]
["Grand Total",null,0,{"$error":"#N/A"}]

{"sheet":"PivotSpeed","index":18,"n_rows":5,"n_cols":3,"rows_kept":5,"cut":false,"hidden":true,"merged":[]}
[null,"Values"]
["Row Labels","Sum of Speed","Sum of Climber Index"]
["(blank)"]
["(blank)",{"$error":"#N/A"},{"$error":"#N/A"}]
["Grand Total",{"$error":"#N/A"},{"$error":"#N/A"}]

{"sheet":"PivotWeight","index":19,"n_rows":5,"n_cols":3,"rows_kept":5,"cut":false,"hidden":true,"merged":[]}
[null,"Values"]
["Row Labels","Sum of Weight","Sum of HR"]
["(blank)"]
["(blank)",{"$error":"#N/A"},{"$error":"#N/A"}]
["Grand Total",{"$error":"#N/A"},{"$error":"#N/A"}]

{"sheet":"PivotAddWeight","index":20,"n_rows":3,"n_cols":2,"rows_kept":3,"cut":false,"hidden":true,"merged":[]}
["Row Labels","Average of lb"]
["(blank)"]
["(blank)"]

{"sheet":"PivotWeightTarget","index":21,"n_rows":5,"n_cols":3,"rows_kept":5,"cut":false,"hidden":true,"merged":[]}
[null,"Values"]
["Row Labels","Sum of Weight","Sum of Weight Goal"]
["(blank)"]
["(blank)",{"$error":"#N/A"},{"$error":"#N/A"}]
["Grand Total",{"$error":"#N/A"},{"$error":"#N/A"}]

{"sheet":"PivotCalTarget","index":22,"n_rows":5,"n_cols":3,"rows_kept":5,"cut":false,"hidden":true,"merged":[]}
[null,"Values"]
["Row Labels","Sum of Cal.","Sum of Cal. Goal Chart"]
["(blank)"]
["(blank)",null,0]
["Grand Total",null,0]

{"sheet":"PivotHRTarget","index":23,"n_rows":5,"n_cols":3,"rows_kept":5,"cut":false,"hidden":true,"merged":[]}
[null,"Values"]
["Row Labels","Sum of HR","Sum of HR Goal"]
["(blank)"]
["(blank)",{"$error":"#N/A"},{"$error":"#N/A"}]
["Grand Total",{"$error":"#N/A"},{"$error":"#N/A"}]

{"sheet":"PivotPowerTarget","index":24,"n_rows":5,"n_cols":3,"rows_kept":5,"cut":false,"hidden":true,"merged":[]}
[null,"Values"]
["Row Labels","Sum of Power","Sum of Power Goal"]
["(blank)"]
["(blank)"]
["Grand Total"]